{"text_format":"1","workbook":"xlsx","n_sheets":16,"sheets":["Cover","Home","Company Info","Main menu","Form U1","Form U2","Form U3","Form U4","Form F-1a","Form F-1b","Form F-2a","Form F-2b","Form F-3a","Form F-3b","Rural Certification","Instructions"],"not_rendered":{"charts":0,"images":0,"macros":1,"external_links":0,"defined_names":28,"comments":2,"pivot_tables":0},"unopened":[],"bounds":{"document_bytes":16777216,"sheet_cells":100000,"rows_first":2000,"rows_last":500,"rows_between":2000,"halvings":0,"cell_chars":16384,"cell_head_chars":4096},"cells_cut":0,"cells_raw":0,"read":"whole","date_system":"1900"}

{"sheet":"Cover","index":0,"n_rows":22,"n_cols":12,"rows_kept":22,"cut":false,"hidden":false,"merged":[[18,0,19,14],[21,0,25,14],[8,0,13,14],[15,0,17,14]]}
[" ",null,null,null,null,null,null,null,null,"OMB Approved No. ",null,"3060-0895"]
[null,null,null,null,null,null,null,null,null,{"$f":"'Main menu'!A3","v":"Est. Burden Per Response: 44.4 hrs"}]
[null,null,null,null,null,null,null,null,null,"Edition Date: June 2016"]
[]
["FCC Form 502"]
["North American Numbering Plan Numbering Resource Utilization/Forecast (NRUF) Report"]
[]
[]
["Notice:  The ten digit North American Numbering Plan currently being used by the United States and 19 other countries is being depleted.  Management of this resource requires uniform reporting of utilization and forecast data.  Under the Communications Act Of 1934 as amended by The Telecommunications Act of 1996 the FCC was given “exclusive jurisdiction over those portions of the North American Numbering Plan that pertain to the United States.”  Pursuant to that authority the Commission conducted a rulemaking that among other things addressed regular reporting on numbering use by United States carriers.  In its Report and Order in CC Docket No. 99-200, In the Matter of Numbering Resource Optimization (rel. Mar. 31, 2000) the Commission found that mandatory data collection is necessary to efficiently monitor and manage numbering use.  Your response is mandatory."]
[]
{"$rows_left_out":13}
{"sheet":"Home","index":1,"n_rows":23,"n_cols":45,"rows_kept":23,"cut":false,"hidden":false,"merged":[[22,0,27,13],[4,0,5,13],[0,37,0,38],[2,1,2,10],[7,0,8,13],[0,4,0,10],[0,14,0,18],[3,14,4,18],[1,14,2,18]]}
[" ",null," ",null,"GENERAL INSTRUCTIONS",null,null,null,null,null,null,null,null,null,{"$f":"'Main menu'!A2","v":"OMB Approved No: 3060-0895"},null,null,null,null,null,null,null,null,null,null,null,null,null,"NPA-NXX","X",0,0,0,0,0,{"$f":"IF(1000-(AE1+AF1+AG1+AH1+AI1)>-1, 1000-(AE1+AF1+AG1+AH1+AI1),\"Error\")","v":1000}," ","Utilization   =",null,{"$f":"IF(AF1=1000,\"Intermed\",(IF((AK1=\"X\")*AND(AJ1>899),\"Donated\",(AE1/(1000-AF1)))))","v":0},{"$f":"(IF((AK1=\"X\")*AND(AJ1<900),\"Error, Exceeds 10% Contamination \",(IF(AF1>0,\"Insert Intermediate Assignee Name Here\",IF((AK1)=\"X\",\"Donated to Pool\",\"  \")))))","v":"  "},null,null,null," "]
[null,null,null," "," "," ",null,null,null,null,null,null,null,null,{"$f":"'Main menu'!A3","v":"Est. Burden Per Response: 44.4 hrs"}]
[null,"Users that are familiar with these forms may proceed directly to the \"Main Menu\""]
[null,null,null,null,null," ",null,null,null,null,null,null,null,null,{"$f":"'Main menu'!A4","v":"Edition Date: June 2016"}]
["This report contains twelve forms for collecting utilization and forecast data from carriers.  "]
[]
[]
["All carriers should file at least three forms:  (1) one company information form; (2) one utilization data form; and (3) one forecast data form.  Many carriers will need to file more than one utilization or forecast form.  For example, carriers that receive numbers from both the Numbering Administrator and another carrier must file separate Primary and Intermediate carrier forms."]
[]
[]
{"$rows_left_out":14}
{"sheet":"Company Info","index":2,"n_rows":26,"n_cols":44,"rows_kept":26,"cut":false,"hidden":false,"merged":[[19,0,20,14],[25,0,26,14],[0,0,0,14],[5,0,5,14],[18,0,18,1],[18,2,18,5],[12,8,16,13]]}
["  COMPANY INFORMATION"]
[null,null,null,null,null,null,null,{"$f":"'Main menu'!A1&\", \"&'Main menu'!A2&\", \"&'Main menu'!A3&\", \"&'Main menu'!A4","v":"FCC Form 502 , OMB Approved No: 3060-0895, Est. Burden Per Response: 44.4 hrs, Edition Date: June 2016"}]
[]
["Please enter your company information below. "]
[]
["Parent OCN refers to the OCN of the reporting carrier's parent company located within the applicable state.  If the reporting carrier has more than one parent company in a particular state (e.g., if the  reporting carrier is a subsidiary of company A, which in turn is a subsidiary of company B, so that both companies A and B could be deemed the reporting carrier's \"parent\"), the reporting carrier should report the OCN of the highest parent company (in this example, the appropriate parent would be Company B)."]
[]
["Parent Company Name",null,null,"<Parent Company Name>",null,null,null,null,null,"Parent Company OCN ","<PC OCN>",null,null,null,null,null,null,null,null,null,null,13,1,"CAP or CLEC"]
["Service Provider Name",null,null,"<Service Provider Name>",null,null,null,null,null,"Service Provider OCN ","<SP OCN>",null,null,null,null,null,null,null,null,null,null,null,2,"Incumbent Local Exchange Carrier (ILEC)"]
["Company Address",null,null,"<Company Address>",null,null,null,null,null,"Service Provider FRN ","<SP FRN>",null,null,null,null,null,null,null,null,null,null,null,3,"Interconnected VoIP",null,null,null,null,null,null,null,null,null,null,null,null,null,null,null,null,null,null,null," "]
{"$rows_left_out":17}
{"sheet":"Main menu","index":3,"n_rows":10,"n_cols":44,"rows_kept":10,"cut":false,"hidden":false,"merged":[[8,1,8,3],[7,36,7,37],[2,36,2,37],[6,36,6,37],[8,5,8,11],[8,36,8,37]]}
["FCC Form 502 "]
["OMB Approved No: 3060-0895"]
["Est. Burden Per Response: 44.4 hrs",null,null,null,null,null,"MAIN MENU",null,null,null,null,null,null,null,null,null,null,null,null,null,null,null,null,null,null,null,null,"NPA-NXX","X",0,0,0,0,0,{"$f":"IF(1000-(AD3+AE3+AF3+AG3+AH3)>-1, 1000-(AD3+AE3+AF3+AG3+AH3),\"Error\")","v":1000}," ","Utilization   =",null,{"$f":"IF(AE3=1000,\"Intermed\",(IF((AJ3=\"X\")*AND(AI3>899),\"Donated\",(AD3/(1000-AE3)))))","v":0},{"$f":"(IF((AJ3=\"X\")*AND(AI3<900),\"Error, Exceeds 10% Contamination \",(IF(AE3>0,\"Insert Intermediate Assignee Name Here\",IF((AJ3)=\"X\",\"Donated to Pool\",\"  \")))))","v":"  "},null,null,null," "]
["Edition Date: June 2016",null,null,null,null,null,null,null,null,null,"                             "]
[null,null,null,null,null,null,null,null,null,null,null,null,null,null,null,null,null,null,null,null,null,null,null,null,null,null,null," "," "," "," "," "," "," "," "," "," "," "," ","  "]
[null,null,null,null,null,null,null,null,null,null,null,null,null,null,null,null,null,null,null,null,null,null,true,null,null,null,null,null,null,null," ",null,null,null,null," ",null," "]
[null,null,null,null,null,null,">>>Please Read Detailed Instructions Before Completing Forms<<<",null,null,null,null,null,null,null,null,null,null,null,null,null,null,null,null,null,null,null,null,"NPA-NXX",0,0,0,0,0,0,{"$f":"IF(1000-(AD7+AE7+AF7+AG7+AH7)>-1, 1000-(AD7+AE7+AF7+AG7+AH7),\"Error\")","v":1000}," ","Utilization   =",null,{"$f":"IF(AE7=1000,\"Intermed\",(IF((AJ7=\"X\")*AND(AI7>899),\"Donated\",(AD7/(1000-AE7)))))","v":0},{"$f":"(IF((AJ7=\"X\")*AND(AI7<900),\"Error, Exceeds 10% Contamination \",(IF(AE7>0,\"Insert Intermediate Assignee Name Here\",IF((AJ7)=\"X\",\"Donated to Pool\",\"  \")))))","v":"  "}]
[null,null,null,null,null,null,null,null,null,null,null,null,null,null,null,null,null,null,null,null,null,null,null,null,null,null,null,{"$f":"#REF!","v":{"$error":"#REF!"}},4,0,0,0,0,0,{"$f":"IF(1000-(AD8+AE8+AF8+AG8+AH8)>-1, 1000-(AD8+AE8+AF8+AG8+AH8),\"Error\")","v":1000}," ","Utilization   =",null,{"$f":"IF(AE8=1000,\"Intermed\",(IF((AJ8=\"X\")*AND(AI8>899),\"Donated\",(AD8/(1000-AE8)))))","v":0},{"$f":"(IF((AJ8=\"X\")*AND(AI8<900),\"Error, Exceeds 10% Contamination \",(IF(AE8>0,\"Insert Intermediate Assignee Name Here\",IF((AJ8)=\"X\",\"Donated to Pool\",\"  \")))))","v":"  "}]
[null,"Utilization Forms",null,null,null,"Forecast Forms",null,null,null,null,null,null,null,null,null,null,null,null,null,null,null,null,null,null,null,null,null,{"$f":" AB8","v":{"$error":"#REF!"}},5,0,0,0,0,0,{"$f":"IF(1000-(AD9+AE9+AF9+AG9+AH9)>-1, 1000-(AD9+AE9+AF9+AG9+AH9),\"Error\")","v":1000}," ","Utilization   =",null,{"$f":"IF(AE9=1000,\"Intermed\",(IF((AJ9=\"X\")*AND(AI9>899),\"Donated\",(AD9/(1000-AE9)))))","v":0},{"$f":"(IF((AJ9=\"X\")*AND(AI9<900),\"Error, Exceeds 10% Contamination \",(IF(AE9>0,\"Insert Intermediate Assignee Name Here\",IF((AJ9)=\"X\",\"Donated to Pool\",\"  \")))))","v":"  "}]
[null,null,null,null,null,null,"Initial",null,null,null,"Growth",null,null,null,null,null,null,null,null,null,null,null," ",null,null,null,null,null,null,"Lookup",0]
{"$rows_left_out":1}
{"sheet":"Form U1","index":4,"n_rows":21,"n_cols":179,"rows_kept":21,"cut":false,"hidden":false,"merged":[[11,8,15,12]]}
[null,null,null,null,null,null,null,null,"Form U1 - UTILIZATION REPORTING FORM (FOR NON-RURAL PRIMARY CARRIERS)",null,null,null,null,null,null,null,null,null,null,null,null,null,null,null,null,null,null,null,null,null,null,null,null,null,null,null,null,null,null,null,null,null,null,null,null,null,null,null,null,null,null,null,null,null,null,null,null,null,null,null,null,null,null,null,null,null,null,null,null,null,null,null,null,null,null,null,null,null,null,null,null,null,null,null,null,null,null,null,null,null,null,null,null,null,null,null,null,null,null,null,null,null,null,null,null,null,null,null,null,null,null,null,null,null,null,null,null,null,null,null,null,null,null,null,null,null,null,null,null,null,null,null,null,null,null,null,null,null,null,null,null,null,null,null,null,null,null,null,null,null,null,null,null,null,null,null,null,null,null,null,null,null,null,null,null,null,null,null,null,null,null,null,null,null,null,null,null,null,"Bad Parent Company, Bad Service Provider Name, Bad Company Address, Bad Parent Company, Bad Service Provider Name, Bad Company Address, Bad Parent Company, Bad Service Provider Name, Bad Company Address"]
[null,null,null,null,null,null,null,null,">>> Please See The Instructions Before Completing This Form <<<"]
[null,null,null,"Check this box if the data on this form replaces the data on a previously submitted form."]
[]
[]
[]
["Parent Company Name",null,null,{"$f":"IF('Company Info'!D8=\"\",\"\",'Company Info'!D8)","v":"<Parent Company Name>"},null,null,null,null,"Parent Company OCN ",null,{"$f":"IF('Company Info'!K8=\"\",\"\",'Company Info'!K8)","v":"<PC OCN>"}]
["Service Provider Name",null,null,{"$f":"IF('Company Info'!D9=\"\",\"\",'Company Info'!D9)","v":"<Service Provider Name>"},null,null,null,null,"Service Provider OCN ",null,{"$f":"IF('Company Info'!K9=\"\",\"\",'Company Info'!K9)","v":"<SP OCN>"}]
["Company Address",null,null,{"$f":"IF('Company Info'!D10=\"\",\"\",'Company Info'!D10)","v":"<Company Address>"},null,null,null,null,"Service Provider FRN ",null,{"$f":"IF('Company Info'!K10=\"\",\"\",'Company Info'!K10)","v":"<SP FRN>"}]
["Address 2",null,null,{"$f":"IF('Company Info'!D11=\"\",\"\",'Company Info'!D11)","v":"<Address 2>"},null,null,null,null,"SP Service Type ",null,{"$f":"IF('Company Info'!K11=\"\",\"\",'Company Info'!K11)","v":"<SP Service Type>"}]
{"$rows_left_out":12}
{"sheet":"Form U2","index":5,"n_rows":21,"n_cols":17,"rows_kept":21,"cut":false,"hidden":false,"merged":[[11,8,15,12]]}
[null,null,null,null,null,null,null,null,"Form U2 - UTILIZATION REPORTING FORM (FOR RURAL PRIMARY CARRIERS)"]
[null,null,null,null,null,null,null,null,">>> Please See The Instructions Before Completing This Form <<<"]
[null,null,null,"Check this box if the data on this form replaces the data on a previously submitted form."]
[]
[]
[]
["Parent Company Name",null,null,{"$f":"IF('Company Info'!D8=\"\",\"\",'Company Info'!D8)","v":"<Parent Company Name>"},null,null,null,null,"Parent Company OCN ",null,{"$f":"IF('Company Info'!K8=\"\",\"\",'Company Info'!K8)","v":"<PC OCN>"}]
["Service Provider Name",null,null,{"$f":"IF('Company Info'!D9=\"\",\"\",'Company Info'!D9)","v":"<Service Provider Name>"},null,null,null,null,"Service Provider OCN ",null,{"$f":"IF('Company Info'!K9=\"\",\"\",'Company Info'!K9)","v":"<SP OCN>"}]
["Company Address",null,null,{"$f":"IF('Company Info'!D10=\"\",\"\",'Company Info'!D10)","v":"<Company Address>"},null,null,null,null,"Service Provider FRN ",null,{"$f":"IF('Company Info'!K10=\"\",\"\",'Company Info'!K10)","v":"<SP FRN>"}]
["Address 2",null,null,{"$f":"IF('Company Info'!D11=\"\",\"\",'Company Info'!D11)","v":"<Address 2>"},null,null,null,null,"SP Service Type ",null,{"$f":"IF('Company Info'!K11=\"\",\"\",'Company Info'!K11)","v":"<SP Service Type>"}]
{"$rows_left_out":12}
{"sheet":"Form U3","index":6,"n_rows":21,"n_cols":17,"rows_kept":21,"cut":false,"hidden":false,"merged":[[11,8,15,12]]}
[null,null,null,null,null,null,null,null,"Form U3 - UTILIZATION REPORTING FORM (FOR NON-RURAL INTERMEDIATE CARRIERS)"]
[null,null,null,null,null,null,null,null,">>> Please See The Instructions Before Completing This Form <<<"]
[null,null,null,"Check this box if the data on this form replaces the data on a previously submitted form."]
[]
[]
[]
["Parent Company Name",null,null,{"$f":"IF('Company Info'!D8=\"\",\"\",'Company Info'!D8)","v":"<Parent Company Name>"},null,null,null,null,"Parent Company OCN ",null,{"$f":"IF('Company Info'!K8=\"\",\"\",'Company Info'!K8)","v":"<PC OCN>"}]
["Service Provider Name",null,null,{"$f":"IF('Company Info'!D9=\"\",\"\",'Company Info'!D9)","v":"<Service Provider Name>"},null,null,null,null,"Service Provider OCN ",null,{"$f":"IF('Company Info'!K9=\"\",\"\",'Company Info'!K9)","v":"<SP OCN>"}]
["Company Address",null,null,{"$f":"IF('Company Info'!D10=\"\",\"\",'Company Info'!D10)","v":"<Company Address>"},null,null,null,null,"Service Provider FRN ",null,{"$f":"IF('Company Info'!K10=\"\",\"\",'Company Info'!K10)","v":"<SP FRN>"}]
["Address 2",null,null,{"$f":"IF('Company Info'!D11=\"\",\"\",'Company Info'!D11)","v":"<Address 2>"},null,null,null,null,"SP Service Type ",null,{"$f":"IF('Company Info'!K11=\"\",\"\",'Company Info'!K11)","v":"<SP Service Type>"}]
{"$rows_left_out":12}
{"sheet":"Form U4","index":7,"n_rows":21,"n_cols":17,"rows_kept":21,"cut":false,"hidden":false,"merged":[[11,8,15,12]]}
[null,null,null,null,null,null,null,null,"Form U4 - UTILIZATION REPORTING FORM (FOR RURAL INTERMEDIATE CARRIERS)"]
[null,null,null,null,null,null,null,null,">>> Please See The Instructions Before Completing This Form <<<"]
[null,null,null,"Check this box if the data on this form replaces the data on a previously submitted form."]
[]
[]
[]
["Parent Company Name",null,null,{"$f":"IF('Company Info'!D8=\"\",\"\",'Company Info'!D8)","v":"<Parent Company Name>"},null,null,null,null,"Parent Company OCN ",null,{"$f":"IF('Company Info'!K8=\"\",\"\",'Company Info'!K8)","v":"<PC OCN>"}]
["Service Provider Name",null,null,{"$f":"IF('Company Info'!D9=\"\",\"\",'Company Info'!D9)","v":"<Service Provider Name>"},null,null,null,null,"Service Provider OCN ",null,{"$f":"IF('Company Info'!K9=\"\",\"\",'Company Info'!K9)","v":"<SP OCN>"}]
["Company Address",null,null,{"$f":"IF('Company Info'!D10=\"\",\"\",'Company Info'!D10)","v":"<Company Address>"},null,null,null,null,"Service Provider FRN ",null,{"$f":"IF('Company Info'!K10=\"\",\"\",'Company Info'!K10)","v":"<SP FRN>"}]
["Address 2",null,null,{"$f":"IF('Company Info'!D11=\"\",\"\",'Company Info'!D11)","v":"<Address 2>"},null,null,null,null,"SP Service Type ",null,{"$f":"IF('Company Info'!K11=\"\",\"\",'Company Info'!K11)","v":"<SP Service Type>"}]
{"$rows_left_out":12}
{"sheet":"Form F-1a","index":8,"n_rows":22,"n_cols":12,"rows_kept":22,"cut":false,"hidden":false,"merged":[[12,6,16,9]]}
[null,null,null,null,null,"Form F-1a -   FORECAST REPORTING FORM (FOR POOLING CARRIERS)"]
[null,null,null,null,null,"(INITIAL THOUSAND BLOCKS)"]
[null,null,null,null,null,">>> Please See The Instructions Before Completing This Form <<<"]
[null,"Check this box if the data on this form replaces the data on a previously submitted form."]
[]
[]
[]
["Parent Company Name",null,{"$f":"IF('Company Info'!D8=\"\",\"\",'Company Info'!D8)","v":"<Parent Company Name>"},null,null,null,"Parent Company OCN ",null,null,{"$f":"IF('Company Info'!K8=\"\",\"\",'Company Info'!K8)","v":"<PC OCN>"}]
["Service Provider Name",null,{"$f":"IF('Company Info'!D9=\"\",\"\",'Company Info'!D9)","v":"<Service Provider Name>"},null,null,null,"Service Provider OCN ",null,null,{"$f":"IF('Company Info'!K9=\"\",\"\",'Company Info'!K9)","v":"<SP OCN>"}]
["Company Address",null,{"$f":"IF('Company Info'!D10=\"\",\"\",'Company Info'!D10)","v":"<Company Address>"},null,null,null,"Service Provider FRN ",null,null,{"$f":"IF('Company Info'!K10=\"\",\"\",'Company Info'!K10)","v":"<SP FRN>"}]
{"$rows_left_out":13}
{"sheet":"Form F-1b","index":9,"n_rows":22,"n_cols":12,"rows_kept":22,"cut":false,"hidden":false,"merged":[[12,6,16,9]]}
[null,null,null,null,null,"Form F-1b -   FORECAST REPORTING FORM (FOR POOLING CARRIERS)"]
[null,null,null,null,null,"(GROWTH THOUSAND BLOCKS)"]
[null,null,null,null,null,">>> Please See The Instructions Before Completing This Form <<<"]
[null,"Check this box if the data on this form replaces the data on a previously submitted form."]
[]
[]
[]
["Parent Company Name",null,{"$f":"IF('Company Info'!D8=\"\",\"\",'Company Info'!D8)","v":"<Parent Company Name>"},null,null,null,"Parent Company OCN ",null,null,{"$f":"IF('Company Info'!K8=\"\",\"\",'Company Info'!K8)","v":"<PC OCN>"}]
["Service Provider Name",null,{"$f":"IF('Company Info'!D9=\"\",\"\",'Company Info'!D9)","v":"<Service Provider Name>"},null,null,null,"Service Provider OCN ",null,null,{"$f":"IF('Company Info'!K9=\"\",\"\",'Company Info'!K9)","v":"<SP OCN>"}]
["Company Address",null,{"$f":"IF('Company Info'!D10=\"\",\"\",'Company Info'!D10)","v":"<Company Address>"},null,null,null,"Service Provider FRN ",null,null,{"$f":"IF('Company Info'!K10=\"\",\"\",'Company Info'!K10)","v":"<SP FRN>"}]
{"$rows_left_out":13}
{"sheet":"Form F-2a","index":10,"n_rows":22,"n_cols":12,"rows_kept":22,"cut":false,"hidden":false,"merged":[[12,6,16,9]]}
[null,null,null,null,null,"Form F-2a -   FORECAST REPORTING FORM (FOR NON-POOLING CARRIERS IN POOLING AREAS)"]
[null,null,null,null,null,"(INITIAL CODES)"]
[null,null,null,null,null,">>> Please See The Instructions Before Completing This Form <<<"]
[null,"Check this box if the data on this form replaces the data on a previously submitted form."]
[]
[]
[]
["Parent Company Name",null,{"$f":"IF('Company Info'!D8=\"\",\"\",'Company Info'!D8)","v":"<Parent Company Name>"},null,null,null,"Parent Company OCN ",null,null,{"$f":"IF('Company Info'!K8=\"\",\"\",'Company Info'!K8)","v":"<PC OCN>"}]
["Service Provider Name",null,{"$f":"IF('Company Info'!D9=\"\",\"\",'Company Info'!D9)","v":"<Service Provider Name>"},null,null,null,"Service Provider OCN ",null,null,{"$f":"IF('Company Info'!K9=\"\",\"\",'Company Info'!K9)","v":"<SP OCN>"}]
["Company Address",null,{"$f":"IF('Company Info'!D10=\"\",\"\",'Company Info'!D10)","v":"<Company Address>"},null,null,null,"Service Provider FRN ",null,null,{"$f":"IF('Company Info'!K10=\"\",\"\",'Company Info'!K10)","v":"<SP FRN>"}]
{"$rows_left_out":13}
{"sheet":"Form F-2b","index":11,"n_rows":22,"n_cols":12,"rows_kept":22,"cut":false,"hidden":false,"merged":[[12,6,16,9]]}
[null,null,null,null,null,"Form F-2b -   FORECAST REPORTING FORM (FOR NON-POOLING CARRIERS IN POOLING AREAS)"]
[null,null,null,null,null,"(GROWTH CODES)"]
[null,null,null,null,null,">>> Please See The Instructions Before Completing This Form <<<"]
[null,"Check this box if the data on this form replaces the data on a previously submitted form."]
[]
[]
[]
["Parent Company Name",null,{"$f":"IF('Company Info'!D8=\"\",\"\",'Company Info'!D8)","v":"<Parent Company Name>"},null,null,null,"Parent Company OCN ",null,null,{"$f":"IF('Company Info'!K8=\"\",\"\",'Company Info'!K8)","v":"<PC OCN>"}]
["Service Provider Name",null,{"$f":"IF('Company Info'!D9=\"\",\"\",'Company Info'!D9)","v":"<Service Provider Name>"},null,null,null,"Service Provider OCN ",null,null,{"$f":"IF('Company Info'!K9=\"\",\"\",'Company Info'!K9)","v":"<SP OCN>"}]
["Company Address",null,{"$f":"IF('Company Info'!D10=\"\",\"\",'Company Info'!D10)","v":"<Company Address>"},null,null,null,"Service Provider FRN ",null,null,{"$f":"IF('Company Info'!K10=\"\",\"\",'Company Info'!K10)","v":"<SP FRN>"}]
{"$rows_left_out":13}
{"sheet":"Form F-3a","index":12,"n_rows":22,"n_cols":12,"rows_kept":22,"cut":false,"hidden":false,"merged":[[12,6,16,9]]}
[null,null,null,null,null,"Form F-3a -   FORECAST REPORTING FORM (FOR CARRIERS IN NON-POOLING AREAS)"]
[null,null,null,null,null,"(INITIAL CODES)"]
[null,null,null,null,null,">>> Please See The Instructions Before Completing This Form <<<"]
[null,"Check this box if the data on this form replaces the data on a previously submitted form."]
[]
[]
[]
["Parent Company Name",null,{"$f":"IF('Company Info'!D8=\"\",\"\",'Company Info'!D8)","v":"<Parent Company Name>"},null,null,null,"Parent Company OCN ",null,null,{"$f":"IF('Company Info'!K8=\"\",\"\",'Company Info'!K8)","v":"<PC OCN>"}]
["Service Provider Name",null,{"$f":"IF('Company Info'!D9=\"\",\"\",'Company Info'!D9)","v":"<Service Provider Name>"},null,null,null,"Service Provider OCN ",null,null,{"$f":"IF('Company Info'!K9=\"\",\"\",'Company Info'!K9)","v":"<SP OCN>"}]
["Company Address",null,{"$f":"IF('Company Info'!D10=\"\",\"\",'Company Info'!D10)","v":"<Company Address>"},null,null,null,"Service Provider FRN ",null,null,{"$f":"IF('Company Info'!K10=\"\",\"\",'Company Info'!K10)","v":"<SP FRN>"}]
{"$rows_left_out":13}
{"sheet":"Form F-3b","index":13,"n_rows":22,"n_cols":12,"rows_kept":22,"cut":false,"hidden":false,"merged":[[12,6,16,9]]}
[null,null,null,null,null,"Form F-3b -   FORECAST REPORTING FORM (FOR CARRIERS IN NON-POOLING AREAS)"]
[null,null,null,null,null,"(GROWTH CODES)"]
[null,null,null,null,null,">>> Please See The Instructions Before Completing This Form <<<"]
[null,"Check this box if the data on this form replaces the data on a previously submitted form."]
[]
[]
[]
["Parent Company Name",null,{"$f":"IF('Company Info'!D8=\"\",\"\",'Company Info'!D8)","v":"<Parent Company Name>"},null,null,null,"Parent Company OCN ",null,null,{"$f":"IF('Company Info'!K8=\"\",\"\",'Company Info'!K8)","v":"<PC OCN>"}]
["Service Provider Name",null,{"$f":"IF('Company Info'!D9=\"\",\"\",'Company Info'!D9)","v":"<Service Provider Name>"},null,null,null,"Service Provider OCN ",null,null,{"$f":"IF('Company Info'!K9=\"\",\"\",'Company Info'!K9)","v":"<SP OCN>"}]
["Company Address",null,{"$f":"IF('Company Info'!D10=\"\",\"\",'Company Info'!D10)","v":"<Company Address>"},null,null,null,"Service Provider FRN ",null,null,{"$f":"IF('Company Info'!K10=\"\",\"\",'Company Info'!K10)","v":"<SP FRN>"}]
{"$rows_left_out":13}
{"sheet":"Rural Certification","index":14,"n_rows":26,"n_cols":24,"rows_kept":26,"cut":false,"hidden":false,"merged":[]}
[null,null,null,null,null,"RURAL CERTIFICATION FORM"]
[null,null,null,null,null,">>> Please See The Instructions Before Completing This Form <<<"]
[]
[null,null,null,null,null,"This form must be completed by an officer of the reporting company",null,null,null,null,null,null,null,null,null,null,null,null,null,null,null,null,null,false]
[null,null," "]
[]
[null,null,null,null,null,null,null,null,null,null,null,null,null," "]
[]
[null,null,null,null,null,null,null,null,null,null," "]
["I,"," <Officer Name>,",null,null,null," certify that ",{"$f":" 'Company Info'!D9","v":"<Service Provider Name>"},null,null,null,"operating as a "]
{"$rows_left_out":17}
{"sheet":"Instructions","index":15,"n_rows":277,"n_cols":14,"rows_kept":277,"cut":false,"hidden":false,"merged":[[153,0,160,15],[276,0,285,15],[169,0,170,15],[248,0,250,15],[253,0,256,15],[258,0,261,15],[217,0,221,15],[223,0,225,15],[264,0,273,15],[205,0,209,15],[232,0,236,15],[1,3,1,14],[7,2,7,13],[73,0,79,15],[162,0,167,15],[245,0,245,15],[118,0,130,15],[132,0,141,15],[82,0,88,15],[145,0,151,15],[213,0,215,15],[211,0,211,2],[173,0,175,15],[178,0,189,15],[106,0,116,15],[91,0,97,15],[100,0,104,15],[64,0,68,15],[48,0,52,15],[56,0,59,15],[60,0,62,15],[9,0,14,15],[54,0,54,2],[17,0,30,15]]}
[]
[" "," "," ","           INSTRUCTIONS FOR UTILIZATION AND  FORECAST FORMS"]
[]
[null,null," "]
[]
[null,null,null,null,null,null,null,null,null,null," ",null,null," "]
[]
[" ",null,"                      >>>Please Read Thoroughly Before Completing Forms<<<"]
["When to File:"]
["Reporting carriers shall file utililization and forecast reports semi-annually on or before February 1 for the preceding 6 month reporting period ending on December 31, and on or before August 1 for the preceding 6 month reporting period ending on June 30.  Reporting is mandatory.  "]
{"$rows_left_out":267}